Reaction Details
TargetTissue-type plasminogen activator
LigandBDBM13280
Substrate/Competitorn/a
Meas. Tech.ChEMBL_208075 (CHEMBL813534)
Ki>10000±n/a nM
Citation Ewing, WRBecker, MRManetta, VEDavis, RSPauls, HWMason, HChoi-Sledeski, YMGreen, DCha, DSpada, APCheney, DLMason, JSMaignan, SGuilloteau, JPBrown, KColussi, DBentley, RBostwick, JKasiewski, CJMorgan, SRLeadley, RJDunwiddie, CTPerrone, MHChu, V Design and structure-activity relationships of potent and selective inhibitors of blood coagulation factor Xa. J Med Chem42:3557-71 (1999) 
 
Tissue-type plasminogen activator
Name:Tissue-type plasminogen activator
Type:Enzyme
Mol. Mass.:62931.08
Organism:Homo sapiens (Human)
Description:n/a
Residue:562
BDBM13280
NameBDBM13280
Synonyms:3-{[(3S)-3-[(7-methoxynaphthalene-2-)sulfonamido]-2-oxopyrrolidin-1-yl]methyl}benzene-1-carboximidamide Sulfonamidopyrrolidinone 3a
TypeSmall organic molecule
Emp. Form.C23H24N4O4S
Mol. Mass.452.526
SMILESCOc1ccc2ccc(cc2c1)S(=O)(=O)N[C@H]1CCN(Cc2cccc(c2)C(N)=N)C1=O