Reaction Details
TargetProthrombin
LigandBDBM50080495
Substrate/Competitorn/a
Meas. Tech.ChEMBL_208339 (CHEMBL813571)
Ki>4000±n/a nM
Citation Ewing, WRBecker, MRManetta, VEDavis, RSPauls, HWMason, HChoi-Sledeski, YMGreen, DCha, DSpada, APCheney, DLMason, JSMaignan, SGuilloteau, JPBrown, KColussi, DBentley, RBostwick, JKasiewski, CJMorgan, SRLeadley, RJDunwiddie, CTPerrone, MHChu, V Design and structure-activity relationships of potent and selective inhibitors of blood coagulation factor Xa. J Med Chem42:3557-71 (1999) 
 
Prothrombin
Name:Prothrombin
Type:Protein
Mol. Mass.:70029.57
Organism:Homo sapiens (Human)
Description:P00734
Residue:622
BDBM50080495
NameBDBM50080495
Synonyms:3-[(S)-3-(Biphenyl-3-sulfonylamino)-2-oxo-pyrrolidin-1-ylmethyl]-benzamidine | CHEMBL333958
TypeSmall organic molecule
Emp. Form.C24H24N4O3S
Mol. Mass.448.537
SMILESNC(=N)c1cccc(CN2CC[C@H](NS(=O)(=O)c3cccc(c3)-c3ccccc3)C2=O)c1