Reaction Details
TargetCoagulation factor X
LigandBDBM13282
Substrate/Competitorn/a
Meas. Tech.ChEMBL_49301 (CHEMBL661582)
Ki 22±n/a nM
Citation Ewing, WRBecker, MRManetta, VEDavis, RSPauls, HWMason, HChoi-Sledeski, YMGreen, DCha, DSpada, APCheney, DLMason, JSMaignan, SGuilloteau, JPBrown, KColussi, DBentley, RBostwick, JKasiewski, CJMorgan, SRLeadley, RJDunwiddie, CTPerrone, MHChu, V Design and structure-activity relationships of potent and selective inhibitors of blood coagulation factor Xa. J Med Chem42:3557-71 (1999) 
 
Coagulation factor X
Name:Coagulation factor X
Type:Enzyme
Mol. Mass.:54726.60
Organism:Homo sapiens (Human)
Description:n/a
Residue:488
BDBM13282
NameBDBM13282
Synonyms:3-{[(3S)-3-[(7-methoxynaphthalene-2-)(methyl)sulfonamido]-2-oxopyrrolidin-1-yl]methyl}benzene-1-carboximidamide Sulfonamidopyrrolidinone 3b
TypeSmall organic molecule
Emp. Form.C24H26N4O4S
Mol. Mass.466.553
SMILESCOc1ccc2ccc(cc2c1)S(=O)(=O)N(C)[C@H]1CCN(Cc2cccc(c2)C(N)=N)C1=O