Reaction Details
TargetAnionic trypsin
LigandBDBM50080498
Substrate/Competitorn/a
Meas. Tech.ChEMBL_212180 (CHEMBL817744)
Ki 1080±n/a nM
Citation Ewing, WRBecker, MRManetta, VEDavis, RSPauls, HWMason, HChoi-Sledeski, YMGreen, DCha, DSpada, APCheney, DLMason, JSMaignan, SGuilloteau, JPBrown, KColussi, DBentley, RBostwick, JKasiewski, CJMorgan, SRLeadley, RJDunwiddie, CTPerrone, MHChu, V Design and structure-activity relationships of potent and selective inhibitors of blood coagulation factor Xa. J Med Chem42:3557-71 (1999) 
 
Anionic trypsin
Name:Anionic trypsin
Type:PROTEIN
Mol. Mass.:26281.39
Organism:Bos taurus
Description:ChEMBL_212177
Residue:247
BDBM50080498
NameBDBM50080498
Synonyms:3-{(S)-3-[(7-Methoxy-naphthalene-2-sulfonyl)-thiophen-3-ylmethyl-amino]-2-oxo-pyrrolidin-1-ylmethyl}-benzamidine | CHEMBL119456
TypeSmall organic molecule
Emp. Form.C28H28N4O4S2
Mol. Mass.548.676
SMILESCOc1ccc2ccc(cc2c1)S(=O)(=O)N(Cc1ccsc1)[C@H]1CCN(Cc2cccc(c2)C(N)=N)C1=O