Reaction Details
TargetProthrombin
LigandBDBM50080478
Substrate/Competitorn/a
Meas. Tech.ChEMBL_208339 (CHEMBL813571)
Ki>4000±n/a nM
Citation Ewing, WRBecker, MRManetta, VEDavis, RSPauls, HWMason, HChoi-Sledeski, YMGreen, DCha, DSpada, APCheney, DLMason, JSMaignan, SGuilloteau, JPBrown, KColussi, DBentley, RBostwick, JKasiewski, CJMorgan, SRLeadley, RJDunwiddie, CTPerrone, MHChu, V Design and structure-activity relationships of potent and selective inhibitors of blood coagulation factor Xa. J Med Chem42:3557-71 (1999) 
 
Prothrombin
Name:Prothrombin
Type:Protein
Mol. Mass.:70029.57
Organism:Homo sapiens (Human)
Description:P00734
Residue:622
BDBM50080478
NameBDBM50080478
Synonyms:3-[3-(2-Naphthalen-2-yl-ethyl)-indol-1-ylmethyl]-benzamidine | CHEMBL118906
TypeSmall organic molecule
Emp. Form.C28H25N3
Mol. Mass.403.5182
SMILESNC(=N)c1cccc(Cn2cc(CCc3ccc4ccccc4c3)c3ccccc23)c1