Reaction Details
TargetCoagulation factor X
LigandBDBM50080490
Substrate/Competitorn/a
Meas. Tech.ChEMBL_49301 (CHEMBL661582)
Ki 9900±n/a nM
Citation Ewing, WRBecker, MRManetta, VEDavis, RSPauls, HWMason, HChoi-Sledeski, YMGreen, DCha, DSpada, APCheney, DLMason, JSMaignan, SGuilloteau, JPBrown, KColussi, DBentley, RBostwick, JKasiewski, CJMorgan, SRLeadley, RJDunwiddie, CTPerrone, MHChu, V Design and structure-activity relationships of potent and selective inhibitors of blood coagulation factor Xa. J Med Chem42:3557-71 (1999) 
 
Coagulation factor X
Name:Coagulation factor X
Type:Enzyme
Mol. Mass.:54726.60
Organism:Homo sapiens (Human)
Description:n/a
Residue:488
BDBM50080490
NameBDBM50080490
Synonyms:3-[(S)-3-(Naphthalene-2-sulfonylamino)-2-oxo-azetidin-1-ylmethyl]-benzamidine | CHEMBL120765
TypeSmall organic molecule
Emp. Form.C21H20N4O3S
Mol. Mass.408.473
SMILESNC(=N)c1cccc(CN2C[C@H](NS(=O)(=O)c3ccc4ccccc4c3)C2=O)c1