Reaction Details
TargetIntegrase
LigandBDBM50073630
Substrate/Competitorn/a
Meas. Tech.ChEMBL_88621 (CHEMBL701725)
IC50 80.0±n/a nM
Citation King, PJMa, GMiao, WJia, QMcDougall, BRReinecke, MGCornell, CKuan, JKim, TRRobinson, WE Structure-activity relationships: analogues of the dicaffeoylquinic and dicaffeoyltartaric acids as potent inhibitors of human immunodeficiency virus type 1 integrase and replication. J Med Chem42:497-509 (1999) 
 
Integrase
Name:Integrase
Synonyms:Human immunodeficiency virus type 1 integrase
Type:PROTEIN
Mol. Mass.:32231.48
Organism:Human immunodeficiency virus 1
Description:ChEMBL_90865
Residue:288
BDBM50073630
NameBDBM50073630
TypeSmall organic molecule
Emp. Form.C22H18O12
Mol. Mass.474.3711
SMILESOC(=O)C(OC(=O)\C=C\c1ccc(O)c(O)c1)C(OC(=O)\C=C\c1ccc(O)c(O)c1)C(O)=O