Reaction Details
Target5-hydroxytryptamine receptor 3A/3B
LigandBDBM50076423
Substrate/Competitorn/a
Meas. Tech.ChEMBL_3233 (CHEMBL618919)
Ki 19±n/a nM
Citation Cappelli, AAnzini, MVomero, SCanullo, LMennuni, LMakovec, FDoucet, EHamon, MMenziani, MCDe Benedetti, PGBruni, GRomeo, MRGiorgi, GDonati, A Novel potent and selective central 5-HT3 receptor ligands provided with different intrinsic efficacy. 2. Molecular basis of the intrinsic efficacy of arylpiperazine derivatives at the central 5-HT3 receptors. J Med Chem42:1556-75 (1999) 
 
5-hydroxytryptamine receptor 3A/3B
Name:5-hydroxytryptamine receptor 3A/3B
Type:n/a
Mol. Mass.:n/a
Description:ASSAY_ID of EBI is 2974
Components:This complex has 2 components.
Component 1
Name:5-hydroxytryptamine receptor 3B
Synonyms:5HT3B_RAT Serotonin (5-HT) receptor
Type:PROTEIN
Mol. Mass.:50328.78
Organism:Rattus norvegicus
Description:EBI_11885
Residue:437
Component 2
Name:5-hydroxytryptamine receptor 3A
Synonyms:5-HT3 5HT3A_RAT Htr3 Serotonin (5-HT) receptor | Zacopride site-R
Type:Enzyme Catalytic Domain
Mol. Mass.:55428.70
Organism:RAT
Description:5-HT3 HTR3A RAT::P35563
Residue:483
BDBM50076423
NameBDBM50076423
Synonyms:7-(4-Methyl-piperazin-1-yl)-6H-5-thia-8-aza-benzo[c]phenanthrene | CHEMBL38919
TypeSmall organic molecule
Emp. Form.C21H21N3S
Mol. Mass.347.477
SMILESCN1CCN(CC1)c1nc2ccccc2c-2c1CSc1ccccc-21