Reaction Details
TargetGag-Pol polyprotein
LigandBDBM50065802
Substrate/Competitorn/a
Meas. Tech.ChEMBL_88784 (CHEMBL699442)
IC50>100000.00±n/a nM
Citation Ouali, MLaboulais, CLeh, HGill, DDesmaële, DMekouar, KZouhiri, Fd'Angelo, JAuclair, CMouscadet, JFLe Bret, M Modeling of the inhibition of retroviral integrases by styrylquinoline derivatives. J Med Chem43:1949-57 (2000) Gag-Pol polyprotein
Name:Gag-Pol polyprotein
Type:PROTEIN
Mol. Mass.:173907.80
Organism:Rous sarcoma virus (strain Prague C) (RSV-PrC)
Description:ChEMBL_88784
Residue:1603
BDBM50065802
NameBDBM50065802
Synonyms:Acetic acid 2-acetoxy-5-[(E)-2-(8-acetoxy-quinolin-2-yl)-vinyl]-phenyl ester CHEMBL58923
TypeSmall organic molecule
Emp. Form.C23H19NO6
Mol. Mass.405.4001
SMILESCC(=O)Oc1ccc(\C=C\c2ccc3cccc(OC(C)=O)c3n2)cc1OC(C)=O