Reaction Details
TargetDelta-type opioid receptor
LigandBDBM50089779
Substrate/Competitorn/a
Meas. Tech.ChEMBL_147342 (CHEMBL756187)
Ki 2.6±n/a nM
Citation Le Bourdonnec, BEl Kouhen, RLunzer, MMLaw, PYLoh, HHPortoghese, PS Reporter affinity labels: an o-phthalaldehyde derivative of beta-naltrexamine as a fluorogenic ligand for opioid receptors. J Med Chem43:2489-92 (2000) Delta-type opioid receptor
Name:Delta-type opioid receptor
Type:G Protein-Coupled Receptor (GPCR)
Mol. Mass.:40382.98
Organism:Homo sapiens (Human)
Description:Competition binding assays were carried out using membrane preparations from transfected HN9.10 cells that constitutively expressed the delta opioid receptor.
Residue:372
BDBM50089779
NameBDBM50089779
Synonyms:4-cyclopropylmethyl-14-(3,4-diformylphenylcarboxamidomethylcarboxamido)-10,17-dihydroxy-12-oxa-4-azapentacyclo[9.6.1.01,13.05,17.07,18]octadeca-7(18),8,10-triene
TypeSmall organic molecule
Emp. Form.C31H33N3O7
Mol. Mass.559.6096
SMILESOc1ccc2CC3N(CC4CC4)CCC45C(Oc1c24)[C@@H](CC[C@@]35O)NC(=O)CNC(=O)c1ccc(C=O)c(C=O)c1