Reaction Details
TargetGTPase HRas
LigandBDBM50089971
Substrate/Competitorn/a
Meas. Tech.ChEMBL_82664 (CHEMBL694129)
IC50 20±n/a nM
Citation Baraldi, PGRomagnoli, RBeria, ICozzi, PGeroni, CMongelli, NBianchi, NMischiati, CGambari, R Synthesis and antitumor activity of new benzoheterocyclic derivatives of distamycin A. J Med Chem43:2675-84 (2000) GTPase HRas
Name:GTPase HRas
Type:Other Protein Type
Mol. Mass.:21293.37
Organism:Homo sapiens (Human)
Description:P01112
Residue:189
BDBM50089971
NameBDBM50089971
Synonyms:5-[Bis-(2-chloro-ethyl)-amino]-1-methyl-1H-indole-2-carboxylic acid (5-{5-[5-(2-carbamimidoyl-ethylcarbamoyl)-1-methyl-1H-pyrrol-3-ylcarbamoyl]-1-methyl-1H-pyrrol-3-ylcarbamoyl}-1-methyl-1H-pyrrol-3-yl)-amide; hydrochloride | CHEMBL552863
TypeSmall organic molecule
Emp. Form.C35H41Cl2N11O4
Mol. Mass.750.677
SMILESCn1cc(NC(=O)c2cc(NC(=O)c3cc(NC(=O)c4cc5cc(ccc5n4C)N(CCCl)CCCl)cn3C)cn2C)cc1C(=O)NCCC(N)=N