Reaction Details
TargetTrypanothione reductase
LigandBDBM50091152
Substrate/Competitorn/a
Meas. Tech.ChEMBL_211806 (CHEMBL811878)
Ki 2300±n/a nM
Citation Khan, MOAustin, SEChan, CYin, HMarks, DVaghjiani, SNKendrick, HYardley, VCroft, SLDouglas, KT Use of an additional hydrophobic binding site, the Z site, in the rational drug design of a new class of stronger trypanothione reductase inhibitor, quaternary alkylammonium phenothiazines. J Med Chem43:3148-56 (2000) Trypanothione reductase
Name:Trypanothione reductase
Type:Homodimer; oxidoreductase
Mol. Mass.:53868.26
Organism:Trypanosoma cruzi
Description:n/a
Residue:492
BDBM50091152
NameBDBM50091152
Synonyms:CHEMBL106108 | [3-(2-Chloro-phenothiazin-10-yl)-propyl]-cyclohexylmethyl-dimethyl-ammonium (OFK003)
TypeSmall organic molecule
Emp. Form.C24H32ClN2S
Mol. Mass.416.042
SMILESC[N+](C)(CCCN1c2ccccc2Sc2ccc(Cl)cc12)CC1CCCCC1