Reaction Details
TargetGlutathione reductase, mitochondrial
LigandBDBM50091149
Substrate/Competitorn/a
Meas. Tech.ChEMBL_72595 (CHEMBL681183)
Ki 2200000±n/a nM
Citation Khan, MOAustin, SEChan, CYin, HMarks, DVaghjiani, SNKendrick, HYardley, VCroft, SLDouglas, KT Use of an additional hydrophobic binding site, the Z site, in the rational drug design of a new class of stronger trypanothione reductase inhibitor, quaternary alkylammonium phenothiazines. J Med Chem43:3148-56 (2000) Glutathione reductase, mitochondrial
Name:Glutathione reductase, mitochondrial
Type:Enzyme
Mol. Mass.:56271.52
Organism:Homo sapiens (Human)
Description:P00390
Residue:522
BDBM50091149
NameBDBM50091149
Synonyms:(4-Chloro-benzyl)-[3-(2-chloro-phenothiazin-10-yl)-propyl]-dimethyl-ammonium (OFK002) | CHEMBL105769
TypeSmall organic molecule
Emp. Form.C24H25Cl2N2S
Mol. Mass.444.439
SMILESC[N+](C)(CCCN1c2ccccc2Sc2ccc(Cl)cc12)Cc1ccc(Cl)cc1