Reaction Details
TargetTrypanothione reductase
LigandBDBM50091154
Substrate/Competitorn/a
Meas. Tech.ChEMBL_211806 (CHEMBL811878)
Ki 770±n/a nM
Citation Khan, MOAustin, SEChan, CYin, HMarks, DVaghjiani, SNKendrick, HYardley, VCroft, SLDouglas, KT Use of an additional hydrophobic binding site, the Z site, in the rational drug design of a new class of stronger trypanothione reductase inhibitor, quaternary alkylammonium phenothiazines. J Med Chem43:3148-56 (2000) Trypanothione reductase
Name:Trypanothione reductase
Type:Homodimer; oxidoreductase
Mol. Mass.:53868.26
Organism:Trypanosoma cruzi
Description:n/a
Residue:492
BDBM50091154
NameBDBM50091154
Synonyms:CHEMBL106901 | [3-(2-Chloro-phenothiazin-10-yl)-propyl]-(3,5-dimethoxy-benzyl)-dimethyl-ammonium (OFK012)
TypeSmall organic molecule
Emp. Form.C26H30ClN2O2S
Mol. Mass.470.046
SMILESCOc1cc(C[N+](C)(C)CCCN2c3ccccc3Sc3ccc(Cl)cc23)cc(OC)c1