Reaction Details
TargetTrypanothione reductase
LigandBDBM50091163
Substrate/Competitorn/a
Meas. Tech.ChEMBL_211805 (CHEMBL811877)
IC50 1200±n/a nM
Citation Khan, MOAustin, SEChan, CYin, HMarks, DVaghjiani, SNKendrick, HYardley, VCroft, SLDouglas, KT Use of an additional hydrophobic binding site, the Z site, in the rational drug design of a new class of stronger trypanothione reductase inhibitor, quaternary alkylammonium phenothiazines. J Med Chem43:3148-56 (2000) Trypanothione reductase
Name:Trypanothione reductase
Type:Homodimer; oxidoreductase
Mol. Mass.:53868.26
Organism:Trypanosoma cruzi
Description:n/a
Residue:492
BDBM50091163
NameBDBM50091163
Synonyms:Benzhydryl-[3-(2-chloro-phenothiazin-10-yl)-propyl]-dimethyl-ammonium (OFK008) | CHEMBL106125
TypeSmall organic molecule
Emp. Form.C30H30ClN2S
Mol. Mass.486.09
SMILESC[N+](C)(CCCN1c2ccccc2Sc2ccc(Cl)cc12)C(c1ccccc1)c1ccccc1