Reaction Details
TargetGag-Pol polyprotein [489-587]
LigandBDBM577
Substrate/Competitorn/a
Meas. Tech.ChEMBL_196351 (CHEMBL804204)
IC50 30±n/a nM
Citation Tyndall, JDReid, RCTyssen, DPJardine, DKTodd, BPassmore, MMarch, DRPattenden, LKBergman, DAAlewood, DHu, SHAlewood, PFBirch, CJMartin, JLFairlie, DP Synthesis, stability, antiviral activity, and protease-bound structures of substrate-mimicking constrained macrocyclic inhibitors of HIV-1 protease. J Med Chem43:3495-504 (2000) Gag-Pol polyprotein [489-587]
Name:Gag-Pol polyprotein [489-587]
Type:Enzyme Subunit
Mol. Mass.:10781.16
Organism:Human immunodeficiency virus type 1
Description:P04585[489-587]
Residue:99
BDBM577
NameBDBM577
Synonyms:(3S)-oxolan-3-yl N-[(2S,3R)-4-[(4-aminobenzene)(2-methylpropyl)sulfonamido]-3-hydroxy-1-phenylbutan-2-yl]carbamate APV Amprenavir CHEMBL116 | VX-478
TypeSmall organic molecule
Emp. Form.C25H35N3O6S
Mol. Mass.505.627
SMILESCC(C)CN(C[C@@H](O)[C@H](Cc1ccccc1)NC(=O)O[C@H]1CCOC1)S(=O)(=O)c1ccc(N)cc1