Reaction Details
TargetCholecystokinin receptor type A
LigandBDBM50092157
Substrate/Competitorn/a
Meas. Tech.ChEMBL_50175 (CHEMBL662233)
IC50 6400±n/a nM
Citation Low, CMBlack, JWBroughton, HBBuck, IMDavies, JMDunstone, DJHull, RAKalindjian, SBMcDonald, IMPether, MJShankley, NPSteel, KI Development of peptide 3D structure mimetics: rational design of novel peptoid cholecystokinin receptor antagonists. J Med Chem43:3505-17 (2000) Cholecystokinin receptor type A
Name:Cholecystokinin receptor type A
Type:Enzyme Catalytic Domain
Mol. Mass.:49676.37
Organism:RAT
Description:Cholecystokinin central 0 RAT::P30551
Residue:444
BDBM50092157
NameBDBM50092157
Synonyms:(4R,5S)-3-Oxo-4,5-diphenyl-pyrazolidine-1-carboxylic acid (4-bromo-phenyl)-amide 3-Oxo-4,5-diphenyl-pyrazolidine-1-carboxylic acid (4-bromo-phenyl)-amide(LY288512) LY-288512
TypeSmall organic molecule
Emp. Form.C22H18BrN3O2
Mol. Mass.436.301
SMILESBrc1ccc(NC(=O)N2NC(=O)[C@@H]([C@H]2c2ccccc2)c2ccccc2)cc1