Reaction Details
TargetGastrin/cholecystokinin type B receptor
LigandBDBM50060321
Substrate/Competitorn/a
Meas. Tech.ChEMBL_48262 (CHEMBL662290)
IC50 3700±n/a nM
Citation Low, CMBlack, JWBroughton, HBBuck, IMDavies, JMDunstone, DJHull, RAKalindjian, SBMcDonald, IMPether, MJShankley, NPSteel, KI Development of peptide 3D structure mimetics: rational design of novel peptoid cholecystokinin receptor antagonists. J Med Chem43:3505-17 (2000) Gastrin/cholecystokinin type B receptor
Name:Gastrin/cholecystokinin type B receptor
Type:Enzyme Catalytic Domain
Mol. Mass.:49196.59
Organism:MOUSE
Description:Cholecystokinin A CCKBR MOUSE::P56481
Residue:453
BDBM50060321
NameBDBM50060321
Synonyms:1H-Indole-2-carboxylic acid ((R)-1-methyl-2-oxo-5-phenyl-2,3-dihydro-1H-benzo[e][1,4]diazepin-3-yl)-amide CCK antagonist synthetic 19 | CHEMBL419764
TypeSmall organic molecule
Emp. Form.C25H20N4O2
Mol. Mass.408.4519
SMILESCN1c2ccccc2C(=N[C@@H](NC(=O)c2cc3ccccc3[nH]2)C1=O)c1ccccc1