Reaction Details
TargetCholinesterase
LigandBDBM50369748
Substrate/Competitorn/a
Meas. Tech.ChEMBL_41591 (CHEMBL654885)
IC50 58.3±n/a nM
Citation Camps, PEl Achab R, naMorral, JMuñoz-Torrero, DBadia, ABaños, JEVivas, NMBarril, XOrozco, MLuque, FJ New tacrine-huperzine A hybrids (huprines): highly potent tight-binding acetylcholinesterase inhibitors of interest for the treatment of Alzheimer's disease. J Med Chem43:4657-66 (2001) Cholinesterase
Name:Cholinesterase
Type:Homotetramer
Mol. Mass.:68422.27
Organism:Homo sapiens (Human)
Description:P06276
Residue:602
BDBM50369748
NameBDBM50369748
Synonyms:CHEMBL208599
TypeSmall organic molecule
Emp. Form.C18H19ClN2
Mol. Mass.298.81
SMILESCCC1=CC2C[C@H](C1)c1c(C2)nc2cc(Cl)ccc2c1N