Reaction Details
TargetProthrombin
LigandBDBM50073316
Substrate/Competitorn/a
Meas. Tech.ChEMBL_208305 (CHEMBL812825)
Ki 15±n/a nM
Citation Leung, DAbbenante, GFairlie, DP Protease inhibitors: current status and future prospects. J Med Chem43:305-41 (2000) Prothrombin
Name:Prothrombin
Type:Protein
Mol. Mass.:70029.57
Organism:Homo sapiens (Human)
Description:P00734
Residue:622
BDBM50073316
NameBDBM50073316
Synonyms:CHEMBL114715 {(R)-1-Cyclohexylmethyl-2-[(S)-2-(3-guanidino-propylcarbamoyl)-piperidin-1-yl]-2-oxo-ethylamino}-acetic acid {[(1R)-2-((2S)-2-{[(3-{[AMINO(IMINO)METHYL]AMINO}PROPYL)AMINO]CARBONYL}PIPERIDINYL)-1-(CYCLOHEXYLMETHYL)-2-OXOETHYL]AMINO}ACETIC ACID
TypeSmall organic molecule
Emp. Form.C21H38N6O4
Mol. Mass.438.5642
SMILESNC(=N)NCCCNC(=O)[C@@H]1CCCCN1C(=O)[C@@H](CC1CCCCC1)NCC(O)=O