Reaction Details
TargetCorticotropin-releasing factor receptor 1
LigandBDBM50084877
Substrate/Competitorn/a
Meas. Tech.ChEMBL_50978 (CHEMBL663521)
Ki 1.2±n/a nM
Citation He, LGilligan, PJZaczek, RFitzgerald, LWMcElroy, JShen, HSSaye, JAKalin, NHShelton, SChrist, DTrainor, GHartig, P 4-(1,3-Dimethoxyprop-2-ylamino)-2,7-dimethyl-8-(2, 4-dichlorophenyl)pyrazolo[1,5-a]-1,3,5-triazine: a potent, orally bioavailable CRF(1) receptor antagonist. J Med Chem43:449-56 (2000) Corticotropin-releasing factor receptor 1
Name:Corticotropin-releasing factor receptor 1
Type:Enzyme
Mol. Mass.:50744.31
Organism:Homo sapiens (Human)
Description:P34998
Residue:444
BDBM50084877
NameBDBM50084877
Synonyms:CHEMBL140143 | [8-(2,4-Dichloro-phenyl)-2,7-dimethyl-pyrazolo[1,5-a][1,3,5]triazin-4-yl]-(1-ethyl-butyl)-amine
TypeSmall organic molecule
Emp. Form.C19H23Cl2N5
Mol. Mass.392.325
SMILESCCCC(CC)Nc1nc(C)nc2c(c(C)nn12)-c1ccc(Cl)cc1Cl