Reaction Details
TargetEndothelin-converting enzyme 1
LigandBDBM50084894
Substrate/Competitorn/a
Meas. Tech.ChEMBL_225950 (CHEMBL843957)
IC50 110±n/a nM
Citation De Lombaert, SBlanchard, LStamford, LBTan, JWallace, EMSatoh, YFitt, JHoyer, DSimonsbergen, DMoliterni, JMarcopoulos, NSavage, PChou, MTrapani, AJJeng, AY Potent and selective non-peptidic inhibitors of endothelin-converting enzyme-1 with sustained duration of action. J Med Chem43:488-504 (2000) Endothelin-converting enzyme 1
Name:Endothelin-converting enzyme 1
Type:Enzyme
Mol. Mass.:87155.11
Organism:Homo sapiens (Human)
Description:P42892
Residue:770
BDBM50084894
NameBDBM50084894
Synonyms:3-Dibenzofuran-3-yl-2-[3-(2,3-dimethoxy-phenyl)-1-phosphono-propylamino]-propionic acid | CHEMBL423751
TypeSmall organic molecule
Emp. Form.C26H28NO8P
Mol. Mass.513.4762
SMILESCOc1cccc(CCC(N[C@@H](Cc2ccc3c(c2)oc2ccccc32)C(O)=O)P(O)(O)=O)c1OC