Reaction Details
TargetNeprilysin
LigandBDBM50084897
Substrate/Competitorn/a
Meas. Tech.ChEMBL_140876 (CHEMBL752507)
IC50 2.7±n/a nM
Citation De Lombaert, SBlanchard, LStamford, LBTan, JWallace, EMSatoh, YFitt, JHoyer, DSimonsbergen, DMoliterni, JMarcopoulos, NSavage, PChou, MTrapani, AJJeng, AY Potent and selective non-peptidic inhibitors of endothelin-converting enzyme-1 with sustained duration of action. J Med Chem43:488-504 (2000) Neprilysin
Name:Neprilysin
Type:Protein
Mol. Mass.:85789.59
Organism:Rattus norvegicus (Rat)
Description:P07861
Residue:750
BDBM50084897
NameBDBM50084897
Synonyms:3-Dibenzofuran-3-yl-2-[3-dibenzofuran-3-yl-2-(phosphonomethyl-amino)-propionylamino]-propionic acid | CHEMBL147157
TypeSmall organic molecule
Emp. Form.C31H27N2O8P
Mol. Mass.586.5284
SMILESOC(=O)[C@H](Cc1ccc2c(c1)oc1ccccc21)NC(=O)[C@H](Cc1ccc2c(c1)oc1ccccc21)NCP(O)(O)=O