Reaction Details
TargetEndothelin-converting enzyme 1
LigandBDBM50084893
Substrate/Competitorn/a
Meas. Tech.ChEMBL_225950 (CHEMBL843957)
IC50 22±n/a nM
Citation De Lombaert, SBlanchard, LStamford, LBTan, JWallace, EMSatoh, YFitt, JHoyer, DSimonsbergen, DMoliterni, JMarcopoulos, NSavage, PChou, MTrapani, AJJeng, AY Potent and selective non-peptidic inhibitors of endothelin-converting enzyme-1 with sustained duration of action. J Med Chem43:488-504 (2000) Endothelin-converting enzyme 1
Name:Endothelin-converting enzyme 1
Type:Enzyme
Mol. Mass.:87155.11
Organism:Homo sapiens (Human)
Description:P42892
Residue:770
BDBM50084893
NameBDBM50084893
Synonyms:(S)-3-(dibenzo[b,d]furan-3-yl)-2-(phosphonomethylamino)propanoic acid CHEMBL146936
TypeSmall organic molecule
Emp. Form.C16H16NO6P
Mol. Mass.349.2751
SMILESOC(=O)[C@H](Cc1ccc2c(c1)oc1ccccc21)NCP(O)(O)=O