Reaction Details
TargetAminopeptidase N
LigandBDBM50087085
Substrate/Competitorn/a
Meas. Tech.ChEMBL_28885 (CHEMBL646583)
Ki 5.3±n/a nM
Citation Chen, HNoble, FMothé, AMeudal, HCoric, PDanascimento, SRoques, BPGeorge, PFournié-Zaluski, MC Phosphinic derivatives as new dual enkephalin-degrading enzyme inhibitors: synthesis, biological properties, and antinociceptive activities. J Med Chem43:1398-408 (2001) Aminopeptidase N
Name:Aminopeptidase N
Type:Protein
Mol. Mass.:108810.25
Organism:Sus scrofa (Pig)
Description:P15145
Residue:963
BDBM50087085
NameBDBM50087085
Synonyms:(2S)-2-[(2S)-3-{[(1S)-1-azaniumyl-2-phenylethyl](hydroxy)phosphoryl}-2-[(4-phenylphenyl)methyl]propanamido]propanoic acid | 1-{[3-Biphenyl-4-yl-2-(1-carboxy-ethylcarbamoyl)-propyl]-hydroxy-phosphinoyl}-2-phenyl-ethyl-ammonium
TypeSmall organic molecule
Emp. Form.C27H32N2O5P
Mol. Mass.495.5266
SMILESC[C@H](NC(=O)[C@H](Cc1ccc(cc1)-c1ccccc1)CP(O)(=O)[C@H]([NH3+])Cc1ccccc1)C(O)=O