Reaction Details
TargetAminopeptidase N
LigandBDBM50087097
Substrate/Competitorn/a
Meas. Tech.ChEMBL_28885 (CHEMBL646583)
Ki 2.2±n/a nM
Citation Chen, HNoble, FMothé, AMeudal, HCoric, PDanascimento, SRoques, BPGeorge, PFournié-Zaluski, MC Phosphinic derivatives as new dual enkephalin-degrading enzyme inhibitors: synthesis, biological properties, and antinociceptive activities. J Med Chem43:1398-408 (2001) Aminopeptidase N
Name:Aminopeptidase N
Type:Protein
Mol. Mass.:108810.25
Organism:Sus scrofa (Pig)
Description:P15145
Residue:963
BDBM50087097
NameBDBM50087097
Synonyms:1-{[2-(1-Carboxy-2-phenyl-ethylcarbamoyl)-3-phenyl-propyl]-hydroxy-phosphinoyl}-ethyl-ammonium
TypeSmall organic molecule
Emp. Form.C21H28N2O5P
Mol. Mass.419.4306
SMILESCC([NH3+])P(O)(=O)C[C@@H](Cc1ccccc1)C(=O)N[C@@H](Cc1ccccc1)C(O)=O