Reaction Details
TargetAngiotensin-converting enzyme
LigandBDBM50087106
Substrate/Competitorn/a
Meas. Tech.ChEMBL_35385 (CHEMBL647301)
Ki 120±n/a nM
Citation Chen, HNoble, FMothé, AMeudal, HCoric, PDanascimento, SRoques, BPGeorge, PFournié-Zaluski, MC Phosphinic derivatives as new dual enkephalin-degrading enzyme inhibitors: synthesis, biological properties, and antinociceptive activities. J Med Chem43:1398-408 (2001) Angiotensin-converting enzyme
Name:Angiotensin-converting enzyme
Type:PROTEIN
Mol. Mass.:150907.81
Organism:Rattus norvegicus
Description:ChEMBL_35219
Residue:1313
BDBM50087106
NameBDBM50087106
Synonyms:(2S)-2-[(2S)-3-{[(1S)-1-azaniumylethyl](hydroxy)phosphoryl}-2-[(4-phenylphenyl)methyl]propanamido]propanoic acid | 1-{[3-Biphenyl-4-yl-2-(1-carboxy-ethylcarbamoyl)-propyl]-hydroxy-phosphinoyl}-ethyl-ammonium
TypeSmall organic molecule
Emp. Form.C21H28N2O5P
Mol. Mass.419.4306
SMILESC[C@@H]([NH3+])P(O)(=O)C[C@@H](Cc1ccc(cc1)-c1ccccc1)C(=O)N[C@@H](C)C(O)=O