Reaction Details
TargetAminopeptidase N
LigandBDBM50087119
Substrate/Competitorn/a
Meas. Tech.ChEMBL_28885 (CHEMBL646583)
Ki 4.9±n/a nM
Citation Chen, HNoble, FMothé, AMeudal, HCoric, PDanascimento, SRoques, BPGeorge, PFournié-Zaluski, MC Phosphinic derivatives as new dual enkephalin-degrading enzyme inhibitors: synthesis, biological properties, and antinociceptive activities. J Med Chem43:1398-408 (2001) Aminopeptidase N
Name:Aminopeptidase N
Type:Protein
Mol. Mass.:108810.25
Organism:Sus scrofa (Pig)
Description:P15145
Residue:963
BDBM50087119
NameBDBM50087119
Synonyms:C-{[3-Biphenyl-4-yl-2-(1-carboxy-2-hydroxy-ethylcarbamoyl)-propyl]-hydroxy-phosphinoyl}-C-phenyl-methyl-ammonium
TypeSmall organic molecule
Emp. Form.C26H30N2O6P
Mol. Mass.497.4994
SMILES[NH3+][C@H](c1ccccc1)P(O)(=O)C[C@@H](Cc1ccc(cc1)-c1ccccc1)C(=O)N[C@@H](CO)C(O)=O