Reaction Details
TargetAminopeptidase N
LigandBDBM50087112
Substrate/Competitorn/a
Meas. Tech.ChEMBL_28885 (CHEMBL646583)
Ki 6.3±n/a nM
Citation Chen, HNoble, FMothé, AMeudal, HCoric, PDanascimento, SRoques, BPGeorge, PFournié-Zaluski, MC Phosphinic derivatives as new dual enkephalin-degrading enzyme inhibitors: synthesis, biological properties, and antinociceptive activities. J Med Chem43:1398-408 (2001) Aminopeptidase N
Name:Aminopeptidase N
Type:Protein
Mol. Mass.:108810.25
Organism:Sus scrofa (Pig)
Description:P15145
Residue:963
BDBM50087112
NameBDBM50087112
Synonyms:1-{[2-(1-Carboxy-2-phenyl-ethylcarbamoyl)-3-phenyl-propyl]-hydroxy-phosphinoyl}-3-methylsulfanyl-propyl-ammonium
TypeSmall organic molecule
Emp. Form.C23H32N2O5PS
Mol. Mass.479.549
SMILESCSCCC([NH3+])P(O)(=O)C[C@@H](Cc1ccccc1)C(=O)N[C@@H](Cc1ccccc1)C(O)=O