Reaction Details
TargetReverse transcriptase/RNaseH
LigandBDBM2483
Substrate/Competitorn/a
Meas. Tech.ChEMBL_196190 (CHEMBL802994)
Ki 300±n/a nM
Citation Campiani, GAiello, FFabbrini, MMorelli, ERamunno, AArmaroli, SNacci, VGarofalo, AGreco, GNovellino, EMaga, GSpadari, SBergamini, AVentura, LBongiovanni, BCapozzi, MBolacchi, FMarini, SColetta, MGuiso, GCaccia, S Quinoxalinylethylpyridylthioureas (QXPTs) as potent non-nucleoside HIV-1 reverse transcriptase (RT) inhibitors. Further SAR studies and identification of a novel orally bioavailable hydrazine-based antiviral agent. J Med Chem44:305-15 (2001) Reverse transcriptase/RNaseH
Name:Reverse transcriptase/RNaseH
Type:PROTEIN
Mol. Mass.:65229.15
Organism:Human immunodeficiency virus 1
Description:ChEMBL_1473730
Residue:566
BDBM2483
NameBDBM2483
Synonyms:(4S)-6-chloro-4-(2-cyclopropylethynyl)-4-(trifluoromethyl)-2,4-dihydro-1H-3,1-benzoxazin-2-one DMP-266 Efavirenz L-743,726 | Sustiva
TypeSmall organic molecule
Emp. Form.C14H9ClF3NO2
Mol. Mass.315.675
SMILESFC(F)(F)[C@]1(OC(=O)Nc2ccc(Cl)cc12)C#CC1CC1