Reaction Details
TargetReverse transcriptase/RNaseH
LigandBDBM50102275
Substrate/Competitorn/a
Meas. Tech.ChEMBL_196185 (CHEMBL882853)
Ki 100±n/a nM
Citation Campiani, GAiello, FFabbrini, MMorelli, ERamunno, AArmaroli, SNacci, VGarofalo, AGreco, GNovellino, EMaga, GSpadari, SBergamini, AVentura, LBongiovanni, BCapozzi, MBolacchi, FMarini, SColetta, MGuiso, GCaccia, S Quinoxalinylethylpyridylthioureas (QXPTs) as potent non-nucleoside HIV-1 reverse transcriptase (RT) inhibitors. Further SAR studies and identification of a novel orally bioavailable hydrazine-based antiviral agent. J Med Chem44:305-15 (2001) Reverse transcriptase/RNaseH
Name:Reverse transcriptase/RNaseH
Type:PROTEIN
Mol. Mass.:65229.15
Organism:Human immunodeficiency virus 1
Description:ChEMBL_1473730
Residue:566
BDBM50102275
NameBDBM50102275
Synonyms:1-(5-Bromo-pyridin-2-yl)-3-[2-(4-oxo-4H-pyrrolo[1,2-a]quinoxalin-5-yl)-ethyl]-thiourea | CHEMBL108221
TypeSmall organic molecule
Emp. Form.C19H16BrN5OS
Mol. Mass.442.332
SMILESBrc1ccc(NC(=S)NCCn2c3ccccc3n3cccc3c2=O)nc1