Reaction Details
TargetReverse transcriptase/RNaseH
LigandBDBM50102278
Substrate/Competitorn/a
Meas. Tech.ChEMBL_196191 (CHEMBL803636)
Ki 1900±n/a nM
Citation Campiani, GAiello, FFabbrini, MMorelli, ERamunno, AArmaroli, SNacci, VGarofalo, AGreco, GNovellino, EMaga, GSpadari, SBergamini, AVentura, LBongiovanni, BCapozzi, MBolacchi, FMarini, SColetta, MGuiso, GCaccia, S Quinoxalinylethylpyridylthioureas (QXPTs) as potent non-nucleoside HIV-1 reverse transcriptase (RT) inhibitors. Further SAR studies and identification of a novel orally bioavailable hydrazine-based antiviral agent. J Med Chem44:305-15 (2001) Reverse transcriptase/RNaseH
Name:Reverse transcriptase/RNaseH
Type:PROTEIN
Mol. Mass.:65229.15
Organism:Human immunodeficiency virus 1
Description:ChEMBL_1473730
Residue:566
BDBM50102278
NameBDBM50102278
Synonyms:CHEMBL105807 | N-(5-bromopyridin-2-yl)-2-pyrrolo[1,2-a]quinoxalin-4-ylhydrazinecarbothioamide
TypeSmall organic molecule
Emp. Form.C17H13BrN6S
Mol. Mass.413.294
SMILESBrc1ccc(NC(=S)NNc2nc3ccccc3n3cccc23)nc1