Reaction Details
TargetReverse transcriptase/RNaseH
LigandBDBM50102277
Substrate/Competitorn/a
Meas. Tech.ChEMBL_196191 (CHEMBL803636)
Ki 22±n/a nM
Citation Campiani, GAiello, FFabbrini, MMorelli, ERamunno, AArmaroli, SNacci, VGarofalo, AGreco, GNovellino, EMaga, GSpadari, SBergamini, AVentura, LBongiovanni, BCapozzi, MBolacchi, FMarini, SColetta, MGuiso, GCaccia, S Quinoxalinylethylpyridylthioureas (QXPTs) as potent non-nucleoside HIV-1 reverse transcriptase (RT) inhibitors. Further SAR studies and identification of a novel orally bioavailable hydrazine-based antiviral agent. J Med Chem44:305-15 (2001) Reverse transcriptase/RNaseH
Name:Reverse transcriptase/RNaseH
Type:PROTEIN
Mol. Mass.:65229.15
Organism:Human immunodeficiency virus 1
Description:ChEMBL_1473730
Residue:566
BDBM50102277
NameBDBM50102277
Synonyms:1-(5-Bromo-pyridin-2-yl)-3-[2-(7,9-difluoro-4-oxo-4H-pyrrolo[1,2-a]quinoxalin-5-yl)-ethyl]-thiourea | CHEMBL316514
TypeSmall organic molecule
Emp. Form.C19H14BrF2N5OS
Mol. Mass.478.313
SMILESFc1cc(F)c2c(c1)n(CCNC(=S)Nc1ccc(Br)cn1)c(=O)c1cccn21