Reaction Details
TargetReverse transcriptase/RNaseH
LigandBDBM50102271
Substrate/Competitorn/a
Meas. Tech.ChEMBL_196190 (CHEMBL802994)
Ki 130±n/a nM
Citation Campiani, GAiello, FFabbrini, MMorelli, ERamunno, AArmaroli, SNacci, VGarofalo, AGreco, GNovellino, EMaga, GSpadari, SBergamini, AVentura, LBongiovanni, BCapozzi, MBolacchi, FMarini, SColetta, MGuiso, GCaccia, S Quinoxalinylethylpyridylthioureas (QXPTs) as potent non-nucleoside HIV-1 reverse transcriptase (RT) inhibitors. Further SAR studies and identification of a novel orally bioavailable hydrazine-based antiviral agent. J Med Chem44:305-15 (2001) Reverse transcriptase/RNaseH
Name:Reverse transcriptase/RNaseH
Type:PROTEIN
Mol. Mass.:65229.15
Organism:Human immunodeficiency virus 1
Description:ChEMBL_1473730
Residue:566
BDBM50102271
NameBDBM50102271
Synonyms:1-(5-Bromo-pyridin-2-yl)-3-[2-(4-oxo-4H-5,9,9b-triaza-cyclopenta[a]naphthalen-5-yl)-ethyl]-thiourea | CHEMBL107535
TypeSmall organic molecule
Emp. Form.C18H15BrN6OS
Mol. Mass.443.32
SMILESBrc1ccc(NC(=S)NCCn2c3cccnc3n3cccc3c2=O)nc1