Reaction Details
TargetReverse transcriptase/RNaseH
LigandBDBM50102272
Substrate/Competitorn/a
Meas. Tech.ChEMBL_196189 (CHEMBL801176)
Ki 1400±n/a nM
Citation Campiani, GAiello, FFabbrini, MMorelli, ERamunno, AArmaroli, SNacci, VGarofalo, AGreco, GNovellino, EMaga, GSpadari, SBergamini, AVentura, LBongiovanni, BCapozzi, MBolacchi, FMarini, SColetta, MGuiso, GCaccia, S Quinoxalinylethylpyridylthioureas (QXPTs) as potent non-nucleoside HIV-1 reverse transcriptase (RT) inhibitors. Further SAR studies and identification of a novel orally bioavailable hydrazine-based antiviral agent. J Med Chem44:305-15 (2001) Reverse transcriptase/RNaseH
Name:Reverse transcriptase/RNaseH
Type:PROTEIN
Mol. Mass.:65229.15
Organism:Human immunodeficiency virus 1
Description:ChEMBL_1473730
Residue:566
BDBM50102272
NameBDBM50102272
Synonyms:1-(5-Bromo-pyridin-2-yl)-3-[2-(4-oxo-4H-imidazo[1,2-a]quinoxalin-5-yl)-ethyl]-thiourea | CHEMBL320557
TypeSmall organic molecule
Emp. Form.C18H15BrN6OS
Mol. Mass.443.32
SMILESBrc1ccc(NC(=S)NCCn2c3ccccc3n3ccnc3c2=O)nc1