Reaction Details
TargetAdenosine receptor A1
LigandBDBM50118810
Substrate/Competitorn/a
Meas. Tech.ChEMBL_29135 (CHEMBL637557)
Ki 4.2±n/a nM
Citation Da Settimo, FPrimofiore, GTaliani, SMarini, AMLa Motta, CNovellino, EGreco, GLavecchia, ATrincavelli, LMartini, C 3-Aryl[1,2,4]triazino[4,3-a]benzimidazol-4(10H)-ones: a new class of selective A1 adenosine receptor antagonists. J Med Chem44:316-27 (2001) Adenosine receptor A1
Name:Adenosine receptor A1
Type:Enzyme Catalytic Domain
Mol. Mass.:36602.99
Organism:BOVINE
Description:ADENOSINE 0 BOVINE::P28190
Residue:326
BDBM50118810
NameBDBM50118810
Synonyms:(2R,3S,4R,5R)-2-(hydroxymethyl)-5-(6-((R)-1-phenylpropan-2-ylamino)-9H-purin-9-yl)-tetrahydrofuran-3,4-diol CHEMBL139000 R-N6-(phenylisopropyl)adenosine
TypeSmall organic molecule
Emp. Form.C19H23N5O4
Mol. Mass.385.417
SMILESC[C@H](Cc1ccccc1)Nc1ncnc2n(cnc12)[C@@H]1O[C@H](CO)[C@@H](O)[C@H]1O