Reaction Details
TargetKappa-type opioid receptor
LigandBDBM50098209
Substrate/Competitorn/a
Meas. Tech.ChEMBL_147226 (CHEMBL754914)
Ki 20±n/a nM
Citation Le Bourdonnec, BEl Kouhen, RPoda, GLaw, PYLoh, HHFerguson, DMPortoghese, PS Covalently induced activation of the delta opioid receptor by a fluorogenic affinity label, 7'-(phthalaldehydecarboxamido)naltrindole (PNTI). J Med Chem44:1017-20 (2001) Kappa-type opioid receptor
Name:Kappa-type opioid receptor
Type:G Protein-Coupled Receptor (GPCR)
Mol. Mass.:42648.76
Organism:Homo sapiens (Human)
Description:P41145
Residue:380
BDBM50098209
NameBDBM50098209
Synonyms:22-cyclopropylmethyl-9-(3,4-diformylphenylcarboxamido)-2,16-dihydroxy-(2S)-14-oxa-11,22-diazaheptacyclo[13.9.1.01,13.02,21.04,12.05,10.019,25]pentacosa-4(12),5(10),6,8,15,17,19(25)-heptaene (PTNI)
TypeSmall organic molecule
Emp. Form.C35H31N3O6
Mol. Mass.589.6371
SMILESOc1ccc2CC3N(CC4CC4)CC[C@@]45C(Oc1c24)c1[nH]c2c(NC(=O)c4ccc(C=O)c(C=O)c4)cccc2c1C[C@@]35O