Reaction Details
TargetBeta-1 adrenergic receptor
LigandBDBM50002134
Substrate/Competitorn/a
Meas. Tech.ChEMBL_218116 (CHEMBL822478)
Ki>100000±n/a nM
Citation Hu, BEllingboe, JHan, SLargis, EMulvey, ROliphant, ASum, FWTillett, J (4-Piperidin-1-yl)phenyl amides: potent and selective human beta(3) agonists. J Med Chem44:1456-66 (2001) Beta-1 adrenergic receptor
Name:Beta-1 adrenergic receptor
Type:G Protein-Coupled Receptor (GPCR)
Mol. Mass.:51338.40
Organism:Homo sapiens (Human)
Description:P08588
Residue:477
BDBM50002134
NameBDBM50002134
Synonyms:5-((2R)-2-{[(2R)-2-(3-chlorophenyl)-2-hydroxyethyl]amino}propyl)-1,3-benzodioxole-2,2-dicarboxylate 5-{2-[2-(3-Chloro-phenyl)-2-hydroxy-ethylamino]-propyl}-benzo[1,3]dioxole-2,2-dicarboxylic acid;Disodium salt CL-316243 disodium 5-((2R)-2-{[(2R)-2-(3-chlorophenyl)-2-hydroxyethyl]amino}propyl)-1,3-benzodioxole-2,2-dicarboxylate | disodium 5-[2-[2-(3-chlorophenyl)-2-hydroxyethylamino]-(2R)-propyl]benzo[d][1,3]dioxole-2,2-dicarboxylate(CL 316,243)
TypeSmall organic molecule
Emp. Form.C20H18ClNO7
Mol. Mass.419.814
SMILESC[C@H](Cc1ccc2OC(Oc2c1)(C([O-])=O)C([O-])=O)NC[C@H](O)c1cccc(Cl)c1