Reaction Details
TargetB2 bradykinin receptor
LigandBDBM50370077
Substrate/Competitorn/a
Meas. Tech.ChEMBL_40444 (CHEMBL652383)
Ki 0.31±n/a nM
Citation Dziadulewicz, EKRitchie, TJHallett, ASnell, CRDavies, JWWrigglesworth, RDunstan, ARBloomfield, GCDrake, GSMcIntyre, PBrown, MCBurgess, GMLee, WDavis, CYaqoob, MPhagoo, SBPhillips, EPerkins, MNCampbell, EADavis, AJRang, HP Nonpeptide bradykinin B2 receptor antagonists: conversion of rodent-selective bradyzide analogues into potent, orally-active human bradykinin B2 receptor antagonists. J Med Chem45:2160-72 (2002) B2 bradykinin receptor
Name:B2 bradykinin receptor
Type:Enzyme Catalytic Domain
Mol. Mass.:44941.22
Organism:RAT
Description:B2 BRADYKININ BDKRB2 RAT::P25023
Residue:396
BDBM50370077
NameBDBM50370077
Synonyms:CHEMBL1907652
TypeSmall organic molecule
Emp. Form.C34H46N8O5S2
Mol. Mass.710.91
SMILESCN(C)CCCN(C)CCCNC(=O)C1CCCN1S(=O)(=O)c1ccc(N[N-]C(=[SH+])NC(c2ccccc2)c2ccccc2)c(c1)[N+]([O-])=O