Reaction Details
TargetB2 bradykinin receptor
LigandBDBM50370081
Substrate/Competitorn/a
Meas. Tech.ChEMBL_40430 (CHEMBL876526)
Ki 34.10±n/a nM
Citation Dziadulewicz, EKRitchie, TJHallett, ASnell, CRDavies, JWWrigglesworth, RDunstan, ARBloomfield, GCDrake, GSMcIntyre, PBrown, MCBurgess, GMLee, WDavis, CYaqoob, MPhagoo, SBPhillips, EPerkins, MNCampbell, EADavis, AJRang, HP Nonpeptide bradykinin B2 receptor antagonists: conversion of rodent-selective bradyzide analogues into potent, orally-active human bradykinin B2 receptor antagonists. J Med Chem45:2160-72 (2002) B2 bradykinin receptor
Name:B2 bradykinin receptor
Type:Enzyme Catalytic Domain
Mol. Mass.:44467.17
Organism:Homo sapiens (Human)
Description:B2 BRADYKININ BDKRB2 HUMAN::P30411
Residue:391
BDBM50370081
NameBDBM50370081
Synonyms:CHEMBL1907654
TypeSmall organic molecule
Emp. Form.C32H40Cl2N8O5S2
Mol. Mass.751.747
SMILESCN(C)CCN(C)CCNC(=O)C1CCCN1S(=O)(=O)c1ccc(N[N-]C(=[SH+])NC(c2ccccc2Cl)c2ccccc2Cl)c(c1)[N+]([O-])=O