Reaction Details
TargetB2 bradykinin receptor
LigandBDBM50409530
Substrate/Competitorn/a
Meas. Tech.ChEMBL_40430 (CHEMBL876526)
Ki 253±n/a nM
Citation Dziadulewicz, EKRitchie, TJHallett, ASnell, CRDavies, JWWrigglesworth, RDunstan, ARBloomfield, GCDrake, GSMcIntyre, PBrown, MCBurgess, GMLee, WDavis, CYaqoob, MPhagoo, SBPhillips, EPerkins, MNCampbell, EADavis, AJRang, HP Nonpeptide bradykinin B2 receptor antagonists: conversion of rodent-selective bradyzide analogues into potent, orally-active human bradykinin B2 receptor antagonists. J Med Chem45:2160-72 (2002) B2 bradykinin receptor
Name:B2 bradykinin receptor
Type:Enzyme Catalytic Domain
Mol. Mass.:44467.17
Organism:Homo sapiens (Human)
Description:B2 BRADYKININ BDKRB2 HUMAN::P30411
Residue:391
BDBM50409530
NameBDBM50409530
Synonyms:CHEMBL2112219
TypeSmall organic molecule
Emp. Form.C35H42ClN7O4S
Mol. Mass.692.27
SMILESCN(C)CCCN(C)CCNC(=O)c1cccn1S(=O)(=O)c1ccc(NNC(=O)NC2c3ccccc3CCc3ccccc23)c(Cl)c1