Reaction Details
TargetMu-type opioid receptor
LigandBDBM50115095
Substrate/Competitorn/a
Meas. Tech.ChEMBL_148240 (CHEMBL753400)
Ki 0.744±n/a nM
Citation McCurdy, CRLe Bourdonnec, BMetzger, TGEl Kouhen, RZhang, YLaw, PYPortoghese, PS Naphthalene dicarboxaldehyde as an electrophilic fluorogenic moiety for affinity labeling: application to opioid receptor affinity labels with greatly improved fluorogenic properties. J Med Chem45:2887-90 (2002) Mu-type opioid receptor
Name:Mu-type opioid receptor
Type:G Protein-Coupled Receptor (GPCR)
Mol. Mass.:44789.51
Organism:Homo sapiens (Human)
Description:P35372
Residue:400
BDBM50115095
NameBDBM50115095
Synonyms:4-cyclopropylmethyl-14-(6,7-diformyl-2-naphthylcarboxamido)-10,17-dihydroxy-12-oxa-4-azapentacyclo[9.6.1.01,13.05,17.07,18]octadeca-7(18),8,10-triene; hydrochloride | CHEMBL555713
TypeSmall organic molecule
Emp. Form.C33H32N2O6
Mol. Mass.552.617
SMILESOc1ccc2CC3N(CC4CC4)CC[C@@]45[C@@H](Oc1c24)[C@@H](CC[C@@]35O)NC(=O)c1ccc2cc(C=O)c(C=O)cc2c1