Reaction Details
TargetChymotrypsinogen A
LigandBDBM50118028
Substrate/Competitorn/a
Meas. Tech.ChEMBL_49927 (CHEMBL664296)
IC50 3000±n/a nM
Citation Macdonald, SJDowle, MDHarrison, LAClarke, GDInglis, GGJohnson, MRShah, PSmith, RAAmour, AFleetwood, GHumphreys, DCMolloy, CRDixon, MGodward, REWonacott, AJSingh, OMHodgson, STHardy, GW Discovery of further pyrrolidine trans-lactams as inhibitors of human neutrophil elastase (HNE) with potential as development candidates and the crystal structure of HNE complexed with an inhibitor (GW475151). J Med Chem45:3878-90 (2002) Chymotrypsinogen A
Name:Chymotrypsinogen A
Type:Serine protease
Mol. Mass.:25670.88
Organism:Bos taurus (bovine)
Description:n/a
Residue:245
BDBM50118028
NameBDBM50118028
Synonyms:3-Isopropyl-1-methanesulfonyl-4-(2-pyrrolidin-1-ylmethyl-oxazole-4-carbonyl)-hexahydro-pyrrolo[3,2-b]pyrrol-2-one; hydrochloride | CHEMBL542949
TypeSmall organic molecule
Emp. Form.C19H28N4O5S
Mol. Mass.424.514
SMILESCC(C)[C@H]1[C@H]2[C@@H](CCN2C(=O)c2coc(CN3CCCC3)n2)N(C1=O)S(C)(=O)=O