Reaction Details
TargetSubstance-P receptor
LigandBDBM50118098
Substrate/Competitorn/a
Meas. Tech.ChEMBL_205883 (CHEMBL872713)
Ki 0.14±n/a nM
Citation Albert, JSAharony, DAndisik, DBarthlow, HBernstein, PRBialecki, RADedinas, RDembofsky, BTHill, DKirkland, KKoether, GMKosmider, BJOhnmacht, CPalmer, WPotts, WRumsey, WShen, LShenvi, ASherwood, SWarwick, PJRussell, K Design, synthesis, and SAR of tachykinin antagonists: modulation of balance in NK(1)/NK(2) receptor antagonist activity. J Med Chem45:3972-83 (2002) Substance-P receptor
Name:Substance-P receptor
Type:G Protein-Coupled Receptor (GPCR)
Mol. Mass.:46254.43
Organism:Homo sapiens (Human)
Description:P25103
Residue:407
BDBM50118098
NameBDBM50118098
Synonyms:(S)-3-Cyano-naphthalene-1-carboxylic acid {2-(3,4-dichloro-phenyl)-4-[4-(2-methanesulfinyl-4-methoxy-phenyl)-piperidin-1-yl]-butyl}-methyl-amide | CHEMBL340326
TypeSmall organic molecule
Emp. Form.C36H37Cl2N3O3S
Mol. Mass.662.668
SMILESCOc1ccc(C2CCN(CC[C@H](CN(C)C(=O)c3cc(cc4ccccc34)C#N)c3ccc(Cl)c(Cl)c3)CC2)c(c1)[S@](C)=O