Reaction Details
Target5-hydroxytryptamine receptor 2C
LigandBDBM50036760
Substrate/Competitorn/a
Meas. Tech.ChEMBL_2969 (CHEMBL620617)
Ki 850±n/a nM
Citation Fletcher, SRBurkamp, FBlurton, PCheng, SKClarkson, RO'Connor, DSpinks, DTudge, Mvan Niel, MBPatel, SChapman, KMarwood, RShepheard, SBentley, GCook, GPBristow, LJCastro, JLHutson, PHMacLeod, AM 4-(Phenylsulfonyl)piperidines: novel, selective, and bioavailable 5-HT(2A) receptor antagonists. J Med Chem45:492-503 (2002) 5-hydroxytryptamine receptor 2C
Name:5-hydroxytryptamine receptor 2C
Type:G Protein-Coupled Receptor (GPCR)
Mol. Mass.:51836.79
Organism:Homo sapiens (Human)
Description:P28335
Residue:458
BDBM50036760
NameBDBM50036760
Synonyms:6-chloro-1'-phenethylspiro[1,2,3,4-tetrahydronaphthalene-2,4'-(hexahydropyridine)]-1-one | CHEMBL122761
TypeSmall organic molecule
Emp. Form.C22H24ClNO
Mol. Mass.353.885
SMILESClc1ccc2C(=O)C3(CCN(CCc4ccccc4)CC3)CCc2c1