Reaction Details
TargetProthrombin
LigandBDBM50118714
Substrate/Competitorn/a
Meas. Tech.ChEMBL_208329 (CHEMBL813561)
Ki>1000±n/a nM
Citation Adang, AEde Man, APVogel, GMGrootenhuis, PDSmit, MJPeters, CAVisser, ARewinkel, JBvan Dinther, TLucas, HKelder, Jvan Aelst, SMeuleman, DGvan Boeckel, CA Unique overlap in the prerequisites for thrombin inhibition and oral bioavailability resulting in potent oral antithrombotics. J Med Chem45:4419-32 (2002) Prothrombin
Name:Prothrombin
Type:Protein
Mol. Mass.:70029.57
Organism:Homo sapiens (Human)
Description:P00734
Residue:622
BDBM50118714
NameBDBM50118714
Synonyms:7-Methoxy-naphthalene-2-sulfonic acid [5-amino-1-(thiazole-2-carbonyl)-pentyl]-amide | CHEMBL139119
TypeSmall organic molecule
Emp. Form.C20H23N3O4S2
Mol. Mass.433.544
SMILESCOc1ccc2ccc(cc2c1)S(=O)(=O)N[C@@H](CCCCN)C(=O)c1nccs1