Reaction Details
TargetProthrombin
LigandBDBM50118715
Substrate/Competitorn/a
Meas. Tech.ChEMBL_208329 (CHEMBL813561)
Ki 376±n/a nM
Citation Adang, AEde Man, APVogel, GMGrootenhuis, PDSmit, MJPeters, CAVisser, ARewinkel, JBvan Dinther, TLucas, HKelder, Jvan Aelst, SMeuleman, DGvan Boeckel, CA Unique overlap in the prerequisites for thrombin inhibition and oral bioavailability resulting in potent oral antithrombotics. J Med Chem45:4419-32 (2002) Prothrombin
Name:Prothrombin
Type:Protein
Mol. Mass.:70029.57
Organism:Homo sapiens (Human)
Description:P00734
Residue:622
BDBM50118715
NameBDBM50118715
Synonyms:7-Amino-3-({1-[2-(carboxymethyl-amino)-3-cyclohexyl-propionyl]-3,3-dimethyl-pyrrolidine-2-carbonyl}-amino)-2-oxo-heptanoic acid | CHEMBL136164
TypeSmall organic molecule
Emp. Form.C25H42N4O7
Mol. Mass.510.6236
SMILESCC1(C)CCN([C@@H]1C(=O)N[C@@H](CCCCN)C(=O)C(O)=O)C(=O)[C@@H](CC1CCCCC1)NCC(O)=O