Reaction Details
TargetProthrombin
LigandBDBM50118717
Substrate/Competitorn/a
Meas. Tech.ChEMBL_208329 (CHEMBL813561)
Ki 2±n/a nM
Citation Adang, AEde Man, APVogel, GMGrootenhuis, PDSmit, MJPeters, CAVisser, ARewinkel, JBvan Dinther, TLucas, HKelder, Jvan Aelst, SMeuleman, DGvan Boeckel, CA Unique overlap in the prerequisites for thrombin inhibition and oral bioavailability resulting in potent oral antithrombotics. J Med Chem45:4419-32 (2002) Prothrombin
Name:Prothrombin
Type:Protein
Mol. Mass.:70029.57
Organism:Homo sapiens (Human)
Description:P00734
Residue:622
BDBM50118717
NameBDBM50118717
Synonyms:(S)-N-((S)-6-amino-1-oxo-1-(thiazol-2-yl)hexan-2-yl)-1-((R)-3-cyclohexyl-2-(ethylsulfonamido)propanoyl)pyrrolidine-2-carboxamide CHEMBL344916
TypeSmall organic molecule
Emp. Form.C25H41N5O5S2
Mol. Mass.555.754
SMILESCCS(=O)(=O)N[C@H](CC1CCCCC1)C(=O)N1CCC[C@H]1C(=O)N[C@@H](CCCCN)C(=O)c1nccs1