Reaction Details
TargetProthrombin
LigandBDBM50118722
Substrate/Competitorn/a
Meas. Tech.ChEMBL_208329 (CHEMBL813561)
Ki 13±n/a nM
Citation Adang, AEde Man, APVogel, GMGrootenhuis, PDSmit, MJPeters, CAVisser, ARewinkel, JBvan Dinther, TLucas, HKelder, Jvan Aelst, SMeuleman, DGvan Boeckel, CA Unique overlap in the prerequisites for thrombin inhibition and oral bioavailability resulting in potent oral antithrombotics. J Med Chem45:4419-32 (2002) Prothrombin
Name:Prothrombin
Type:Protein
Mol. Mass.:70029.57
Organism:Homo sapiens (Human)
Description:P00734
Residue:622
BDBM50118722
NameBDBM50118722
Synonyms:2-Amino-N-{[5-amino-1-(thiazole-2-carbonyl)-pentylcarbamoyl]-methyl}-3-cyclohexyl-N-cyclopropyl-propionamide | CHEMBL446372
TypeSmall organic molecule
Emp. Form.C23H37N5O3S
Mol. Mass.463.637
SMILESNCCCC[C@H](NC(=O)CN(C1CC1)C(=O)[C@H](N)CC1CCCCC1)C(=O)c1nccs1