Reaction Details
TargetProthrombin
LigandBDBM50118725
Substrate/Competitorn/a
Meas. Tech.ChEMBL_208329 (CHEMBL813561)
Ki 15±n/a nM
Citation Adang, AEde Man, APVogel, GMGrootenhuis, PDSmit, MJPeters, CAVisser, ARewinkel, JBvan Dinther, TLucas, HKelder, Jvan Aelst, SMeuleman, DGvan Boeckel, CA Unique overlap in the prerequisites for thrombin inhibition and oral bioavailability resulting in potent oral antithrombotics. J Med Chem45:4419-32 (2002) Prothrombin
Name:Prothrombin
Type:Protein
Mol. Mass.:70029.57
Organism:Homo sapiens (Human)
Description:P00734
Residue:622
BDBM50118725
NameBDBM50118725
Synonyms:7-Amino-3-{[1-(3-carboxy-2-phenylmethanesulfonylamino-propionyl)-pyrrolidine-2-carbonyl]-amino}-2-oxo-heptanoic acid | CHEMBL138986
TypeSmall organic molecule
Emp. Form.C23H32N4O9S
Mol. Mass.540.587
SMILESNCCCC[C@H](NC(=O)[C@@H]1CCCN1C(=O)[C@H](CC(O)=O)NS(=O)(=O)Cc1ccccc1)C(=O)C(O)=O